{"text_format":"1","workbook":"xlsx","n_sheets":4,"sheets":["Rollup","Individual Report","Distances","Data_Dump"],"not_rendered":{"charts":0,"images":0,"macros":1,"external_links":0,"defined_names":5,"comments":0,"pivot_tables":0},"unopened":[],"bounds":{"document_bytes":16777216,"sheet_cells":100000,"rows_first":2000,"rows_last":500,"rows_between":2000,"halvings":0,"cell_chars":16384,"cell_head_chars":4096},"cells_cut":0,"cells_raw":0,"read":"whole","date_system":"1900"}

{"sheet":"Rollup","index":0,"n_rows":22,"n_cols":24,"rows_kept":22,"cut":false,"hidden":false,"merged":[[0,0,0,23],[1,3,1,4],[1,5,1,6],[1,7,1,8],[1,9,1,10],[1,11,1,12],[1,13,1,14],[1,15,1,22],[1,23,2,23]]}
["SDN Attendance 2013 (Google Docs Data)"]
[null,null,null,"CY 2012 to Date",null,"1st Qtr\n(Jan - Mar)",null,"2nd Qtr\n(Apr - June)",null,"3rd Qtr\n(Jul - Sep)",null,"4th Qtr\n(Oct - Dec)",null,"2012 Total",null,"Type",null,null,null,null,null,null,null,"Notes"]
["#","Name","Membership Date","#","%","#","%","#","%","#","%","#","%","#","%","Training","Exercise","Meeting","Demo","Search","TF Training","Other","Total"]
[1,"Jeannette Bayer","2009-04-01",{"$f":"COUNTIF(Data_Dump!#REF!,\"*\" & Rollup!$B4 & \"*\")","v":{"$error":"#REF!"}},{"$f":"D4/$D$22","v":{"$error":"#REF!"}},{"$f":"COUNTIFS(Data_Dump!$E:$E,\"*\"&Rollup!$B4&\"*\",Data_Dump!$B:$B,\">=\"&F$21,Data_Dump!$B:$B,\"<=\"&H$21)","v":10},{"$f":"F4/F$22","v":0.41666666666666669},{"$f":"COUNTIFS(Data_Dump!$E:$E,\"*\"&Rollup!$B4&\"*\",Data_Dump!$B:$B,\">=\"&H$21,Data_Dump!$B:$B,\"<=\"&I$21)","v":6},{"$f":"H4/H$22","v":0.4},{"$f":"COUNTIFS(Data_Dump!$E:$E,\"*\"&Rollup!$B4&\"*\",Data_Dump!$B:$B,\">=\"&J$21,Data_Dump!$B:$B,\"<=\"&L$21)","v":0},{"$f":"J4/J$22","v":{"$error":"#REF!"}},{"$f":"COUNTIFS(Data_Dump!$E:$E,\"*\"&Rollup!$B4&\"*\",Data_Dump!$B:$B,\">=\"&L$21,Data_Dump!$B:$B,\"<=\"&M$21)","v":0},{"$f":"L4/L$22","v":{"$error":"#REF!"}},{"$f":"COUNTIFS(Data_Dump!$E:$E,\"*\"&Rollup!$B4&\"*\",Data_Dump!$B:$B,\">=\"&N$21,Data_Dump!$B:$B,\"<=\"&O$21)","v":0},{"$f":"N4/N$22","v":0},{"$f":"COUNTIFS(Data_Dump!$D:$D,P$3,Data_Dump!$E:$E,\"*\" & Rollup!$B4 & \"*\")","v":11},{"$f":"COUNTIFS(Data_Dump!$D:$D,Q$3,Data_Dump!$E:$E,\"*\" & Rollup!$B4 & \"*\")","v":0},{"$f":"COUNTIFS(Data_Dump!$D:$D,R$3,Data_Dump!$E:$E,\"*\" & Rollup!$B4 & \"*\")","v":1},{"$f":"COUNTIFS(Data_Dump!$D:$D,S$3,Data_Dump!$E:$E,\"*\" & Rollup!$B4 & \"*\")","v":3},{"$f":"COUNTIFS(Data_Dump!$D:$D,T$3,Data_Dump!$E:$E,\"*\" & Rollup!$B4 & \"*\")","v":0},{"$f":"COUNTIFS(Data_Dump!$D:$D,U$3,Data_Dump!$E:$E,\"*\" & Rollup!$B4 & \"*\")","v":0},{"$f":"COUNTIFS(Data_Dump!$D:$D,V$3,Data_Dump!$E:$E,\"*\" & Rollup!$B4 & \"*\")","v":1},{"$f":"SUM(P4:V4)","v":16}]
[2,"Katie Breland","Mrch 2001",{"$f":"COUNTIF(Data_Dump!#REF!,\"*\" & Rollup!$B5 & \"*\")","v":{"$error":"#REF!"}},{"$error":"#REF!"},{"$f":"COUNTIFS(Data_Dump!$E:$E,\"*\"&Rollup!$B5&\"*\",Data_Dump!$B:$B,\">=\"&F$21,Data_Dump!$B:$B,\"<=\"&H$21)","v":14},0.58333333333333337,{"$f":"COUNTIFS(Data_Dump!$E:$E,\"*\"&Rollup!$B5&\"*\",Data_Dump!$B:$B,\">=\"&H$21,Data_Dump!$B:$B,\"<=\"&I$21)","v":5},0.33333333333333331,{"$f":"COUNTIFS(Data_Dump!$E:$E,\"*\"&Rollup!$B5&\"*\",Data_Dump!$B:$B,\">=\"&J$21,Data_Dump!$B:$B,\"<=\"&L$21)","v":0},{"$error":"#REF!"},{"$f":"COUNTIFS(Data_Dump!$E:$E,\"*\"&Rollup!$B5&\"*\",Data_Dump!$B:$B,\">=\"&L$21,Data_Dump!$B:$B,\"<=\"&M$21)","v":0},{"$error":"#REF!"},{"$f":"COUNTIFS(Data_Dump!$E:$E,\"*\"&Rollup!$B5&\"*\",Data_Dump!$B:$B,\">=\"&N$21,Data_Dump!$B:$B,\"<=\"&O$21)","v":0},0,{"$f":"COUNTIFS(Data_Dump!$D:$D,P$3,Data_Dump!$E:$E,\"*\" & Rollup!$B5 & \"*\")","v":12},{"$f":"COUNTIFS(Data_Dump!$D:$D,Q$3,Data_Dump!$E:$E,\"*\" & Rollup!$B5 & \"*\")","v":1},{"$f":"COUNTIFS(Data_Dump!$D:$D,R$3,Data_Dump!$E:$E,\"*\" & Rollup!$B5 & \"*\")","v":1},{"$f":"COUNTIFS(Data_Dump!$D:$D,S$3,Data_Dump!$E:$E,\"*\" & Rollup!$B5 & \"*\")","v":0},{"$f":"COUNTIFS(Data_Dump!$D:$D,T$3,Data_Dump!$E:$E,\"*\" & Rollup!$B5 & \"*\")","v":0},{"$f":"COUNTIFS(Data_Dump!$D:$D,U$3,Data_Dump!$E:$E,\"*\" & Rollup!$B5 & \"*\")","v":5},{"$f":"COUNTIFS(Data_Dump!$D:$D,V$3,Data_Dump!$E:$E,\"*\" & Rollup!$B5 & \"*\")","v":0},19]
[3,"Bill Dozier","2009-05-01",{"$f":"COUNTIF(Data_Dump!#REF!,\"*\" & Rollup!$B6 & \"*\")","v":{"$error":"#REF!"}},{"$error":"#REF!"},{"$f":"COUNTIFS(Data_Dump!$E:$E,\"*\"&Rollup!$B6&\"*\",Data_Dump!$B:$B,\">=\"&F$21,Data_Dump!$B:$B,\"<=\"&H$21)","v":20},0.83333333333333337,{"$f":"COUNTIFS(Data_Dump!$E:$E,\"*\"&Rollup!$B6&\"*\",Data_Dump!$B:$B,\">=\"&H$21,Data_Dump!$B:$B,\"<=\"&I$21)","v":12},0.8,{"$f":"COUNTIFS(Data_Dump!$E:$E,\"*\"&Rollup!$B6&\"*\",Data_Dump!$B:$B,\">=\"&J$21,Data_Dump!$B:$B,\"<=\"&L$21)","v":0},{"$error":"#REF!"},{"$f":"COUNTIFS(Data_Dump!$E:$E,\"*\"&Rollup!$B6&\"*\",Data_Dump!$B:$B,\">=\"&L$21,Data_Dump!$B:$B,\"<=\"&M$21)","v":0},{"$error":"#REF!"},{"$f":"COUNTIFS(Data_Dump!$E:$E,\"*\"&Rollup!$B6&\"*\",Data_Dump!$B:$B,\">=\"&N$21,Data_Dump!$B:$B,\"<=\"&O$21)","v":0},0,{"$f":"COUNTIFS(Data_Dump!$D:$D,P$3,Data_Dump!$E:$E,\"*\" & Rollup!$B6 & \"*\")","v":24},{"$f":"COUNTIFS(Data_Dump!$D:$D,Q$3,Data_Dump!$E:$E,\"*\" & Rollup!$B6 & \"*\")","v":1},{"$f":"COUNTIFS(Data_Dump!$D:$D,R$3,Data_Dump!$E:$E,\"*\" & Rollup!$B6 & \"*\")","v":2},{"$f":"COUNTIFS(Data_Dump!$D:$D,S$3,Data_Dump!$E:$E,\"*\" & Rollup!$B6 & \"*\")","v":3},{"$f":"COUNTIFS(Data_Dump!$D:$D,T$3,Data_Dump!$E:$E,\"*\" & Rollup!$B6 & \"*\")","v":0},{"$f":"COUNTIFS(Data_Dump!$D:$D,U$3,Data_Dump!$E:$E,\"*\" & Rollup!$B6 & \"*\")","v":2},{"$f":"COUNTIFS(Data_Dump!$D:$D,V$3,Data_Dump!$E:$E,\"*\" & Rollup!$B6 & \"*\")","v":0},32]
[4,"Kelly Dozier","2009-11-01",{"$f":"COUNTIF(Data_Dump!#REF!,\"*\" & Rollup!$B7 & \"*\")","v":{"$error":"#REF!"}},{"$error":"#REF!"},{"$f":"COUNTIFS(Data_Dump!$E:$E,\"*\"&Rollup!$B7&\"*\",Data_Dump!$B:$B,\">=\"&F$21,Data_Dump!$B:$B,\"<=\"&H$21)","v":8},0.33333333333333331,{"$f":"COUNTIFS(Data_Dump!$E:$E,\"*\"&Rollup!$B7&\"*\",Data_Dump!$B:$B,\">=\"&H$21,Data_Dump!$B:$B,\"<=\"&I$21)","v":4},0.26666666666666666,{"$f":"COUNTIFS(Data_Dump!$E:$E,\"*\"&Rollup!$B7&\"*\",Data_Dump!$B:$B,\">=\"&J$21,Data_Dump!$B:$B,\"<=\"&L$21)","v":0},{"$error":"#REF!"},{"$f":"COUNTIFS(Data_Dump!$E:$E,\"*\"&Rollup!$B7&\"*\",Data_Dump!$B:$B,\">=\"&L$21,Data_Dump!$B:$B,\"<=\"&M$21)","v":0},{"$error":"#REF!"},{"$f":"COUNTIFS(Data_Dump!$E:$E,\"*\"&Rollup!$B7&\"*\",Data_Dump!$B:$B,\">=\"&N$21,Data_Dump!$B:$B,\"<=\"&O$21)","v":0},0,{"$f":"COUNTIFS(Data_Dump!$D:$D,P$3,Data_Dump!$E:$E,\"*\" & Rollup!$B7 & \"*\")","v":8},{"$f":"COUNTIFS(Data_Dump!$D:$D,Q$3,Data_Dump!$E:$E,\"*\" & Rollup!$B7 & \"*\")","v":0},{"$f":"COUNTIFS(Data_Dump!$D:$D,R$3,Data_Dump!$E:$E,\"*\" & Rollup!$B7 & \"*\")","v":1},{"$f":"COUNTIFS(Data_Dump!$D:$D,S$3,Data_Dump!$E:$E,\"*\" & Rollup!$B7 & \"*\")","v":3},{"$f":"COUNTIFS(Data_Dump!$D:$D,T$3,Data_Dump!$E:$E,\"*\" & Rollup!$B7 & \"*\")","v":0},{"$f":"COUNTIFS(Data_Dump!$D:$D,U$3,Data_Dump!$E:$E,\"*\" & Rollup!$B7 & \"*\")","v":0},{"$f":"COUNTIFS(Data_Dump!$D:$D,V$3,Data_Dump!$E:$E,\"*\" & Rollup!$B7 & \"*\")","v":0},12]
[5,"Cindy Grant","1999-09-01",{"$f":"COUNTIF(Data_Dump!#REF!,\"*\" & Rollup!$B8 & \"*\")","v":{"$error":"#REF!"}},{"$error":"#REF!"},{"$f":"COUNTIFS(Data_Dump!$E:$E,\"*\"&Rollup!$B8&\"*\",Data_Dump!$B:$B,\">=\"&F$21,Data_Dump!$B:$B,\"<=\"&H$21)","v":15},0.625,{"$f":"COUNTIFS(Data_Dump!$E:$E,\"*\"&Rollup!$B8&\"*\",Data_Dump!$B:$B,\">=\"&H$21,Data_Dump!$B:$B,\"<=\"&I$21)","v":11},0.73333333333333328,{"$f":"COUNTIFS(Data_Dump!$E:$E,\"*\"&Rollup!$B8&\"*\",Data_Dump!$B:$B,\">=\"&J$21,Data_Dump!$B:$B,\"<=\"&L$21)","v":0},{"$error":"#REF!"},{"$f":"COUNTIFS(Data_Dump!$E:$E,\"*\"&Rollup!$B8&\"*\",Data_Dump!$B:$B,\">=\"&L$21,Data_Dump!$B:$B,\"<=\"&M$21)","v":0},{"$error":"#REF!"},{"$f":"COUNTIFS(Data_Dump!$E:$E,\"*\"&Rollup!$B8&\"*\",Data_Dump!$B:$B,\">=\"&N$21,Data_Dump!$B:$B,\"<=\"&O$21)","v":0},0,{"$f":"COUNTIFS(Data_Dump!$D:$D,P$3,Data_Dump!$E:$E,\"*\" & Rollup!$B8 & \"*\")","v":17},{"$f":"COUNTIFS(Data_Dump!$D:$D,Q$3,Data_Dump!$E:$E,\"*\" & Rollup!$B8 & \"*\")","v":0},{"$f":"COUNTIFS(Data_Dump!$D:$D,R$3,Data_Dump!$E:$E,\"*\" & Rollup!$B8 & \"*\")","v":1},{"$f":"COUNTIFS(Data_Dump!$D:$D,S$3,Data_Dump!$E:$E,\"*\" & Rollup!$B8 & \"*\")","v":6},{"$f":"COUNTIFS(Data_Dump!$D:$D,T$3,Data_Dump!$E:$E,\"*\" & Rollup!$B8 & \"*\")","v":0},{"$f":"COUNTIFS(Data_Dump!$D:$D,U$3,Data_Dump!$E:$E,\"*\" & Rollup!$B8 & \"*\")","v":0},{"$f":"COUNTIFS(Data_Dump!$D:$D,V$3,Data_Dump!$E:$E,\"*\" & Rollup!$B8 & \"*\")","v":2},26]
[6,"Mary Haislet","2006-09-01",{"$f":"COUNTIF(Data_Dump!#REF!,\"*\" & Rollup!$B9 & \"*\")","v":{"$error":"#REF!"}},{"$error":"#REF!"},{"$f":"COUNTIFS(Data_Dump!$E:$E,\"*\"&Rollup!$B9&\"*\",Data_Dump!$B:$B,\">=\"&F$21,Data_Dump!$B:$B,\"<=\"&H$21)","v":19},0.79166666666666663,{"$f":"COUNTIFS(Data_Dump!$E:$E,\"*\"&Rollup!$B9&\"*\",Data_Dump!$B:$B,\">=\"&H$21,Data_Dump!$B:$B,\"<=\"&I$21)","v":12},0.8,{"$f":"COUNTIFS(Data_Dump!$E:$E,\"*\"&Rollup!$B9&\"*\",Data_Dump!$B:$B,\">=\"&J$21,Data_Dump!$B:$B,\"<=\"&L$21)","v":0},{"$error":"#REF!"},{"$f":"COUNTIFS(Data_Dump!$E:$E,\"*\"&Rollup!$B9&\"*\",Data_Dump!$B:$B,\">=\"&L$21,Data_Dump!$B:$B,\"<=\"&M$21)","v":0},{"$error":"#REF!"},{"$f":"COUNTIFS(Data_Dump!$E:$E,\"*\"&Rollup!$B9&\"*\",Data_Dump!$B:$B,\">=\"&N$21,Data_Dump!$B:$B,\"<=\"&O$21)","v":0},0,{"$f":"COUNTIFS(Data_Dump!$D:$D,P$3,Data_Dump!$E:$E,\"*\" & Rollup!$B9 & \"*\")","v":23},{"$f":"COUNTIFS(Data_Dump!$D:$D,Q$3,Data_Dump!$E:$E,\"*\" & Rollup!$B9 & \"*\")","v":1},{"$f":"COUNTIFS(Data_Dump!$D:$D,R$3,Data_Dump!$E:$E,\"*\" & Rollup!$B9 & \"*\")","v":2},{"$f":"COUNTIFS(Data_Dump!$D:$D,S$3,Data_Dump!$E:$E,\"*\" & Rollup!$B9 & \"*\")","v":2},{"$f":"COUNTIFS(Data_Dump!$D:$D,T$3,Data_Dump!$E:$E,\"*\" & Rollup!$B9 & \"*\")","v":0},{"$f":"COUNTIFS(Data_Dump!$D:$D,U$3,Data_Dump!$E:$E,\"*\" & Rollup!$B9 & \"*\")","v":0},{"$f":"COUNTIFS(Data_Dump!$D:$D,V$3,Data_Dump!$E:$E,\"*\" & Rollup!$B9 & \"*\")","v":3},31]
[7,"Joel Harms","2013-01-01",null,null,{"$f":"COUNTIFS(Data_Dump!$E:$E,\"*\"&Rollup!$B10&\"*\",Data_Dump!$B:$B,\">=\"&F$21,Data_Dump!$B:$B,\"<=\"&H$21)","v":12},0.5,{"$f":"COUNTIFS(Data_Dump!$E:$E,\"*\"&Rollup!$B10&\"*\",Data_Dump!$B:$B,\">=\"&H$21,Data_Dump!$B:$B,\"<=\"&I$21)","v":3},0.2,{"$f":"COUNTIFS(Data_Dump!$E:$E,\"*\"&Rollup!$B10&\"*\",Data_Dump!$B:$B,\">=\"&J$21,Data_Dump!$B:$B,\"<=\"&L$21)","v":0},{"$error":"#REF!"},{"$f":"COUNTIFS(Data_Dump!$E:$E,\"*\"&Rollup!$B10&\"*\",Data_Dump!$B:$B,\">=\"&L$21,Data_Dump!$B:$B,\"<=\"&M$21)","v":0},{"$error":"#REF!"},{"$f":"COUNTIFS(Data_Dump!$E:$E,\"*\"&Rollup!$B10&\"*\",Data_Dump!$B:$B,\">=\"&N$21,Data_Dump!$B:$B,\"<=\"&O$21)","v":0},0,{"$f":"COUNTIFS(Data_Dump!$D:$D,P$3,Data_Dump!$E:$E,\"*\" & Rollup!$B10 & \"*\")","v":15},{"$f":"COUNTIFS(Data_Dump!$D:$D,Q$3,Data_Dump!$E:$E,\"*\" & Rollup!$B10 & \"*\")","v":0},{"$f":"COUNTIFS(Data_Dump!$D:$D,R$3,Data_Dump!$E:$E,\"*\" & Rollup!$B10 & \"*\")","v":0},{"$f":"COUNTIFS(Data_Dump!$D:$D,S$3,Data_Dump!$E:$E,\"*\" & Rollup!$B10 & \"*\")","v":0},{"$f":"COUNTIFS(Data_Dump!$D:$D,T$3,Data_Dump!$E:$E,\"*\" & Rollup!$B10 & \"*\")","v":0},{"$f":"COUNTIFS(Data_Dump!$D:$D,U$3,Data_Dump!$E:$E,\"*\" & Rollup!$B10 & \"*\")","v":0},{"$f":"COUNTIFS(Data_Dump!$D:$D,V$3,Data_Dump!$E:$E,\"*\" & Rollup!$B10 & \"*\")","v":0},{"$f":"SUM(P10:V10)","v":15},"In NM for the summer"]
{"$rows_left_out":13}
{"sheet":"Individual Report","index":1,"n_rows":155,"n_cols":8,"rows_kept":155,"cut":false,"hidden":false,"merged":[[0,0,0,1],[147,3,147,4]]}
[{"$f":"\"SDN Individual Attendance Report 2012 as of \" & TEXT(TODAY(),\"DD MMM YYYY\")","v":"SDN Individual Attendance Report 2012 as of 16 May 2013"},null,"Total Events",{"$f":"COUNTIF(D3:D147,\"X\")","v":15}]
["Date","Location / Event","Type","Joel Harms","Distance"]
[{"$f":"Data_Dump!B2","v":"2013-01-05"},{"$f":"Data_Dump!C2","v":"Lake Bryan"},{"$f":"Data_Dump!D2","v":"Training"},{"$f":"IF((MATCH(\"*\"&D$2&\"*\",Data_Dump!E2,0)>0),\"X\",\"N\")","v":"X"},{"$f":"2*OFFSET(Distances!$G$4,(MATCH($B3,Distances!$A$5:$A$83,0)),0)","v":20},null,null,"Jeannette Bayer"]
[{"$f":"Data_Dump!B3","v":"2013-01-08"},{"$f":"Data_Dump!C3","v":"CTOMA"},{"$f":"Data_Dump!D3","v":"Training"},{"$f":"IF((MATCH(\"*\"&D$2&\"*\",Data_Dump!E3,0)>0),\"X\",\"N\")","v":"X"},{"$f":"2*OFFSET(Distances!$G$4,(MATCH($B4,Distances!$A$5:$A$83,0)),0)","v":808},null,null,"Katie Breland"]
[{"$f":"Data_Dump!B4","v":"2013-01-12"},{"$f":"Data_Dump!C4","v":"Cotton Ranch"},{"$f":"Data_Dump!D4","v":"Training"},{"$f":"IF((MATCH(\"*\"&D$2&\"*\",Data_Dump!E4,0)>0),\"X\",\"N\")","v":"X"},{"$f":"2*OFFSET(Distances!$G$4,(MATCH($B5,Distances!$A$5:$A$83,0)),0)","v":34.799999999999997},null,null,"Bill Dozier"]
[{"$f":"Data_Dump!B5","v":"2013-01-12"},{"$f":"Data_Dump!C5","v":"Canyon Lake"},{"$f":"Data_Dump!D5","v":"Other"},{"$f":"IF((MATCH(\"*\"&D$2&\"*\",Data_Dump!E5,0)>0),\"X\",\"N\")","v":{"$error":"#N/A"}},{"$f":"2*OFFSET(Distances!$G$4,(MATCH($B6,Distances!$A$5:$A$83,0)),0)","v":308},null,null,"Kelly Dozier"]
[{"$f":"Data_Dump!B6","v":"2013-01-15"},{"$f":"Data_Dump!C6","v":"Veteran's Park"},{"$f":"Data_Dump!D6","v":"Training"},{"$f":"IF((MATCH(\"*\"&D$2&\"*\",Data_Dump!E6,0)>0),\"X\",\"N\")","v":"X"},{"$f":"2*OFFSET(Distances!$G$4,(MATCH($B7,Distances!$A$5:$A$83,0)),0)","v":7.2},null,null,"Cindy Grant"]
[{"$f":"Data_Dump!B7","v":"2013-01-19"},{"$f":"Data_Dump!C7","v":"Cotton Ranch south"},{"$f":"Data_Dump!D7","v":"Training"},{"$f":"IF((MATCH(\"*\"&D$2&\"*\",Data_Dump!E7,0)>0),\"X\",\"N\")","v":{"$error":"#N/A"}},{"$f":"2*OFFSET(Distances!$G$4,(MATCH($B8,Distances!$A$5:$A$83,0)),0)","v":30.6},null,null,"Mary Haislet"]
[{"$f":"Data_Dump!B8","v":"2013-01-22"},{"$f":"Data_Dump!C8","v":"Mary's house"},{"$f":"Data_Dump!D8","v":"Training"},{"$f":"IF((MATCH(\"*\"&D$2&\"*\",Data_Dump!E8,0)>0),\"X\",\"N\")","v":{"$error":"#N/A"}},{"$f":"2*OFFSET(Distances!$G$4,(MATCH($B9,Distances!$A$5:$A$83,0)),0)","v":19},null,null,"Joel Harms"]
[{"$f":"Data_Dump!B9","v":"2013-01-26"},{"$f":"Data_Dump!C9","v":"Jones ranch"},{"$f":"Data_Dump!D9","v":"Training"},{"$f":"IF((MATCH(\"*\"&D$2&\"*\",Data_Dump!E9,0)>0),\"X\",\"N\")","v":{"$error":"#N/A"}},{"$f":"2*OFFSET(Distances!$G$4,(MATCH($B10,Distances!$A$5:$A$83,0)),0)","v":{"$error":"#N/A"}},null,null,"D'Lynn Lehew"]
{"$rows_left_out":146}
{"sheet":"Distances","index":2,"n_rows":37,"n_cols":7,"rows_kept":37,"cut":false,"hidden":false,"merged":[]}
["Training Site Distances (one-way)"]
["Location","Street Address","City","State","Zip Code"]
["Home","3902 E 29th St","Bryan","TX"]
["Training Site","Street Address","City","State","Zip Code","Driving","Distance"]
["Austin's Colony","2400 Austin's Colony Parkway","Bryan","TX",null,{"$f":"IF($B$3=B5,\"0\",getGoogDistanceTime($B$3,$C$3,$D$3,$E$3,B5,C5,D5,E5))","v":"3.1 mi, 9 mins"},3.1]
["CEOC","110 N Main","Bryan","TX",null,{"$f":"IF($B$3=B6,\"0\",getGoogDistanceTime($B$3,$C$3,$D$3,$E$3,B6,C6,D6,E6))","v":"3.6 mi, 9 mins"},3.6]
["Brazos River Ranch","County Rd 216","Caldwell","TX",null,{"$f":"IF($B$3=B7,\"0\",getGoogDistanceTime($B$3,$C$3,$D$3,$E$3,B7,C7,D7,E7))","v":"19.6 mi, 28 mins"},19.600000000000001]
["Canyon Lake",null,"Canyon Lake","TX",null,{"$f":"IF($B$3=B8,\"0\",getGoogDistanceTime($B$3,$C$3,$D$3,$E$3,B8,C8,D8,E8))","v":"154 mi, 3 hours 2 mins"},154]
["Cotton Ranch","3300 Sand Creek Rd","Bryan","TX",null,{"$f":"IF($B$3=B9,\"0\",getGoogDistanceTime($B$3,$C$3,$D$3,$E$3,B9,C9,D9,E9))","v":"17.4 mi, 27 mins"},17.399999999999999]
["Cotton Ranch South","1900 Fickey Rd","Bryan","TX",null,{"$f":"IF($B$3=B10,\"0\",getGoogDistanceTime($B$3,$C$3,$D$3,$E$3,B10,C10,D10,E10))","v":"15.3 mi, 22 mins"},15.3]
{"$rows_left_out":28}
{"sheet":"Data_Dump","index":3,"n_rows":60,"n_cols":6,"rows_kept":60,"cut":false,"hidden":false,"merged":[]}
["Timestamp","Date","Location","Type","Attendance","Notes"]
["2013-01-05T08:50:40","2013-01-05","Lake Bryan","Training","Bill Dozier, Cindy Grant, Tim Scott, Blanton Smith, Jim Yeager, Joel Harms"]
["2013-01-08T19:29:52","2013-01-08","CTOMA","Training","Bill Dozier, Kelly Dozier, Cindy Grant, Mary Haislet, Tim Scott, Teresa Medearis, Lois Pritchard, Joel Harms, Megan and Vonda Bob"]
["2013-01-12T09:57:40","2013-01-12","Cotton Ranch","Training","Katie Breland, Joel Harms"]
["2013-01-15T06:17:00","2013-01-12","Canyon Lake","Other","Cindy Grant, Mary Haislet","Water Certification test"]
["2013-01-15T19:44:53","2013-01-15","Veteran's Park","Training","Cindy Grant, Teresa Medearis, Lois Pritchard, Joel harms Kailee Surratt .","First visit for Matt"]
["2013-01-19T11:38:50","2013-01-19","Cotton Ranch south","Training","Katie Breland, Bill Dozier, Mary Haislet, D'Lynn Lehew, Blanton Smith, Jim Yeager, Teresa Medearis, Lois Pritchard, Joel"]
["2013-01-22T18:57:41","2013-01-22","Mary's house","Training","Jeannette Bayer, Katie Breland, Bill Dozier, Kelly Dozier, Mary Haislet, Teresa Medearis, Lois Pritchard","Worked on website and trained Kiba and aziva."]
["2013-01-26T09:54:38","2013-01-26","Jones ranch","Training","Bill Dozier, Kelly Dozier, Cindy Grant, Mary Haislet, Tim Scott, Blanton Smith","Kailee Surrett\nMatt young"]
["2013-01-26T09:55:46","2013-01-26","Disaster City","TF Training","Katie Breland, Ronnie Perry","FEMA"]
{"$rows_left_out":50}